{"text_format":"1","workbook":"xlsx","n_sheets":2,"sheets":["Sayfa1","Metrik_Vida"],"not_rendered":{"charts":0,"images":1,"macros":0,"external_links":0,"defined_names":0,"comments":0,"pivot_tables":0},"unopened":[],"bounds":{"document_bytes":16777216,"sheet_cells":100000,"rows_first":2000,"rows_last":500,"rows_between":2000,"halvings":0,"cell_chars":16384,"cell_head_chars":4096},"cells_cut":0,"cells_raw":0,"read":"whole","date_system":"1900"}

{"sheet":"Sayfa1","index":0,"n_rows":19,"n_cols":15,"rows_kept":19,"cut":false,"hidden":false,"merged":[]}
[]
[]
[null,"Anma Çapı","Kafa Yüksekliği","Kafa Çapı","Yarık Genişliği","Yarık Derinliği"]
[null,"d","k","d2","n","t"]
["M6",{"$f":"HLOOKUP($A$5,Metrik_Vida!$B$13:$H$18,2)","v":6},{"$f":"HLOOKUP($A$5,Metrik_Vida!$B$13:$H$18,3)","v":3.9},{"$f":"HLOOKUP($A$5,Metrik_Vida!$B$13:$H$18,4)","v":10},{"$f":"HLOOKUP($A$5,Metrik_Vida!$B$13:$H$18,5)","v":1.6},{"$f":"HLOOKUP($A$5,Metrik_Vida!$B$13:$H$18,6)","v":2.2000000000000002}]
[]
[]
[]
[]
[]
[]
[]
[null,null,null,null,null,null,null,null,null,null,null,null,null,null,"M2"]
[null,null,null,null,null,null,null,null,null,null,null,null,null,null,"M2.5"]
[null,null,null,null,null,null,null,null,null,null,null,null,null,null,"M3"]
[null,null,null,null,null,null,null,null,null,null,null,null,null,null,"M4"]
[null,null,null,null,null,null,null,null,null,null,null,null,null,null,"M5"]
[null,null,null,null,null,null,null,null,null,null,null,null,null,null,"M6"]
[null,null,null,null,null,null,null,null,null,null,null,null,null,null,"M8"]

{"sheet":"Metrik_Vida","index":1,"n_rows":18,"n_cols":8,"rows_kept":18,"cut":false,"hidden":false,"merged":[]}
[]
[]
[]
[]
[]
[]
[]
[]
[]
[]
[]
[]
[null,"M2","M2.5","M3","M4","M5","M6","M8"]
["Anma çapı d",2,2.5,3,4,5,6,8]
["Kafa Yüksekliği k",1.3,1.6,2,2.6,3.3,3.9,5]
["Kafa Çapı d2",3.8,4.5,5.5,7,8.5,10,13]
["Yarık Genişliği n",0.5,0.6,0.8,1,1.2,1.6,2]
["Yarık Derinliği t",0.8,0.9,1.1499999999999999,1.5,1.8,2.2000000000000002,2.6]